{"text_format":"3","workbook":"xlsx","n_sheets":7,"sheets":["NGS","Ne pas supprimer","Réservé à PlaGe","Lane","Ressource","Version","Pool Robot"],"not_rendered":{"images":17,"defined_names":7,"comments":2},"read":"whole","date_system":"1900"}

{"sheet":"NGS","index":0,"n_rows":33,"n_cols":23,"rows_kept":33,"merged":[[0,0,0,1],[10,3,10,6],[10,7,10,10],[10,11,10,14],[10,15,10,18],[10,19,10,22],[11,3,11,6],[11,7,11,10],[11,11,11,14],[11,15,11,18],[11,19,11,22],[12,3,12,6],[12,7,12,10],[12,11,12,14],[12,15,12,18],[12,19,12,22],[13,3,13,6],[13,7,13,10],[13,11,13,14],[13,15,13,18],[13,19,13,22],[14,3,14,6],[14,7,14,10],[14,11,14,14],[14,15,14,18],[14,19,14,22],[15,3,15,6],[15,7,15,10],[15,11,15,14],[15,15,15,18],[15,19,15,22],[16,3,16,6],[16,7,16,10],[16,11,16,14],[16,15,16,18],[16,19,16,22],[17,3,17,6],[17,7,17,10],[17,11,17,14],[17,15,17,18],[17,19,17,22],[18,3,18,6],[18,7,18,10],[18,11,18,14],[18,15,18,18],[18,19,18,22],[19,3,19,6],[19,7,19,10],[19,11,19,14],[19,15,19,18],[19,19,19,22],[20,3,20,6],[20,7,20,10],[20,11,20,14],[20,15,20,18],[20,19,20,22],[21,3,21,6],[21,7,21,10],[21,11,21,14],[21,15,21,18],[21,19,21,22],[22,3,22,6],[22,7,22,10],[22,11,22,14],[22,15,22,18],[22,19,22,22],[23,3,23,6],[23,7,23,10],[23,11,23,14],[23,15,23,18],[23,19,23,22],[24,3,24,6],[24,7,24,10],[24,11,24,14],[24,15,24,18],[24,19,24,22],[25,3,25,6],[25,7,25,10],[25,11,25,14],[25,15,25,18],[25,19,25,22],[26,3,26,6],[26,7,26,10],[26,11,26,14],[26,15,26,18],[26,19,26,22],[27,3,27,6],[27,7,27,10],[27,11,27,14],[27,15,27,18],[27,19,27,22],[28,3,28,6],[28,7,28,10],[28,11,28,14],[28,15,28,18],[28,19,28,22],[29,3,29,6],[29,7,29,10],[29,11,29,14],[29,15,29,18],[29,19,29,22]]}
["Technique"]
["Machine"]
["Read type"]
["read 1 Length",null,"Number between 0 and 300"]
["read 2 Length",null,"Number between  0 and 300"]
["Index 1 length",null,"Number between 1 and 18"]
["Index 2 length",null,"Number between 0 and 18"]
["Lane quantity"]
[]
[]
[null,null,"Lane",1,{"$nulls":3},2,null,null,3,3,null,null,5,4,null,null,7,5]
[null,null,"Laboratory"]
[null,null,"Team"]
[null,null,"Project"]
[null,null,"Lane name"]
[null,null,"Starting material"]
[null,null,"Starting material description",{"$f":"IFERROR(INDEX(Ressource!$A$3:$B$11,MATCH(D16,Ressource!$A$3:$A$11,0),2),\"\")","v":""},{"$nulls":3},{"$f":"IFERROR(INDEX(Ressource!$A$3:$B$11,MATCH(H16,Ressource!$A$3:$A$11,0),2),\"\")","v":""},{"$nulls":3},{"$f":"IFERROR(INDEX(Ressource!$A$3:$B$11,MATCH(L16,Ressource!$A$3:$A$11,0),2),\"\")","v":""},{"$nulls":3},{"$f":"IFERROR(INDEX(Ressource!$A$3:$B$11,MATCH(P16,Ressource!$A$3:$A$11,0),2),\"\")","v":""},{"$nulls":3},{"$f":"IFERROR(INDEX(Ressource!$A$3:$B$11,MATCH(T16,Ressource!$A$3:$A$11,0),2),\"\")","v":""}]
[null,null,"Library type"]
[null,null,"Library type description",{"$f":"IFERROR(INDEX(Ressource!$E$3:$F$38,MATCH(D18,Ressource!$E$3:$E$38,0),2),\"\")","v":""},{"$nulls":3},{"$f":"IFERROR(INDEX(Ressource!$E$3:$F$38,MATCH(H18,Ressource!$E$3:$E$38,0),2),\"\")","v":""},{"$nulls":3},{"$f":"IFERROR(INDEX(Ressource!$E$3:$F$38,MATCH(L18,Ressource!$E$3:$E$38,0),2),\"\")","v":""},{"$nulls":3},{"$f":"IFERROR(INDEX(Ressource!$E$3:$F$38,MATCH(P18,Ressource!$E$3:$E$38,0),2),\"\")","v":""},{"$nulls":3},{"$f":"IFERROR(INDEX(Ressource!$E$3:$F$38,MATCH(T18,Ressource!$E$3:$E$38,0),2),\"\")","v":""}]
[null,null,"Library selection"]
[null,null,"Library selection description",{"$f":"IFERROR(INDEX(Ressource!$C$3:$D$33,MATCH(D20,Ressource!$C$3:$C$33,0),2),\"\")","v":""},{"$nulls":3},{"$f":"IFERROR(INDEX(Ressource!$C$3:$D$33,MATCH(H20,Ressource!$C$3:$C$33,0),2),\"\")","v":""},{"$nulls":3},{"$f":"IFERROR(INDEX(Ressource!$C$3:$D$33,MATCH(L20,Ressource!$C$3:$C$33,0),2),\"\")","v":""},{"$nulls":3},{"$f":"IFERROR(INDEX(Ressource!$C$3:$D$33,MATCH(P20,Ressource!$C$3:$C$33,0),2),\"\")","v":""},{"$nulls":3},{"$f":"IFERROR(INDEX(Ressource!$C$3:$D$33,MATCH(T20,Ressource!$C$3:$C$33,0),2),\"\")","v":""}]
[null,null,"Pool concentration (nM)"]
[null,null,"Pool volume (µL)"]
[null,null,"Pool average size (pb)"]
[null,null,"% PhiX to include"]
[null,null,"Specie (Scientific name)"]
[null,null,"Taxonomy Id",{"$f":"getTaxonomicId(D26)","v":"Species not specified"},{"$nulls":3},{"$f":"getTaxonomicId(H26)","v":"Species not specified"},{"$nulls":3},{"$f":"getTaxonomicId(L26)","v":"Species not specified"},{"$nulls":3},{"$f":"getTaxonomicId(P26)","v":"Species not specified"},{"$nulls":3},{"$f":"getTaxonomicId(T26)","v":"Species not specified"}]
[null,null,"Indexing type"]
[null,null,"Index kit name"]
[null,null,"Comment"]
[]
["Index name"," i7-i5 sequences",null,"Library name","C° (nM)","Vol (µL)","Library size (pb)","Library name","C° (nM)","Vol (µL)","Library size (pb)","Library name","C° (nM)","Vol (µL)","Library size (pb)","Library name","C° (nM)","Vol (µL)","Library size (pb)","Library name","C° (nM)","Vol (µL)","Library size (pb)"]
["No Index"]

{"sheet":"Ne pas supprimer","index":1,"n_rows":11,"n_cols":3,"rows_kept":11,"hidden":true}
["Type reads","PE","SR"]
["Single Reads",null,"1x150 (Hiseq3000)"]
["Paired-end","2x150 (Hiseq3000)"]
[null,"2x150 Micro V2 (MiSeq)"]
[null,"2x150 Nano V2 (MiSeq)"]
[null,"2x250 Nano V2 (MiSeq)"]
[null,"2x150 V2 (MiSeq)"]
[null,"2x250 V2 (MiSeq)"]
[null,"2x75 V3 (MiSeq)"]
[null,"2x250 V3 (MiSeq)"]
[null,"2x300 V3 (MiSeq)"]

{"sheet":"Réservé à PlaGe","index":2,"n_rows":1,"n_cols":1,"rows_kept":1}
["Réservé à PlaGe"]

{"sheet":"Lane","index":3,"n_rows":999,"n_cols":36,"rows_kept":999}
["Lane",1,"Library name","Index","Code-barres lib pure","Type d'objet","Pool size (pb)","Library size (pb)","Dilution FA","Taille lib FA (pb)","C estimée",null,"Dilution","Code-barres dilution","qPCR (nM)","Dilution 2","Code-barres dilution 2","qPCR 2 (nM)",null,"Dilution 3","Code-barres dilution 3","qPCR 3 (nM)",null,"Dilution utilisée","Code-barres dilution utilisée","qPCR dilution utilisée (nM)","Qté finale dans le pool (fmol)","CB final","Vol. lib pour pool (µl)"]
["Laboratory",{"$nulls":5},{"$f":"IF(C2<>\"\",$B$12,0)","v":0},{"$nulls":16},{"$f":"IFERROR(IF(T2<>\"\",T2,IF(P2<>\"\",P2,M2)),\"\")","v":0},{"$f":"IFERROR(IF(U2<>\"\",U2,IF(Q2<>\"\",Q2,N2)),\"\")","v":0},{"$f":"IFERROR(IF(V2<>\"\",V2,IF(R2<>\"\",R2,O2)),\"\")","v":0},{"$f":"IF(C2<>\"\",20,\"\")","v":""},{"$f":"IF(E2<>\"\",E2,\"\")","v":""},{"$f":"IF(C2<>\"\",IFERROR(IF(V2<>\"\",AA2/V2,IF(R2<>\"\",AA2/R2,IF(O2<>\"\",AA2/O2,0))),\"Erreur\"),\"\")","v":""},{"$f":"IF(C2<>\"\",IFERROR(IF(V2<>\"\",AA2/V2,IF(R2<>\"\",AA2/R2,IF(O2<>\"\",AA2/O2,\"\"))),\"Erreur\"),\"\")","v":""},null,null,{"$f":"IF(E2<>\"\",E2,\"\")","v":""},{"$f":"IF(N2<>\"\",N2,\"\")","v":""},{"$f":"IF(Q2<>\"\",Q2,\"\")","v":""},{"$f":"IF(U2<>\"\",U2,\"\")","v":""}]
["Team",{"$nulls":5},{"$f":"IF(C3<>\"\",$B$12,0)","v":0},{"$nulls":16},{"$f":"IFERROR(IF(T3<>\"\",T3,IF(P3<>\"\",P3,M3)),\"\")","v":0},{"$f":"IFERROR(IF(U3<>\"\",U3,IF(Q3<>\"\",Q3,N3)),\"\")","v":0},{"$f":"IFERROR(IF(V3<>\"\",V3,IF(R3<>\"\",R3,O3)),\"\")","v":0},"","","",{"$nulls":3},"","","",""]
["Project",{"$nulls":5},0,{"$nulls":16},0,0,0,"","","",{"$nulls":3},"","","",""]
["Lane name",{"$nulls":5},0,{"$nulls":16},0,0,0,"","","",{"$nulls":3},"","","",""]
["Nom du Pool",{"$nulls":5},0,{"$nulls":16},0,0,0,"","","",{"$nulls":3},"","","",""]
["Starting material",{"$nulls":5},0,{"$nulls":16},0,0,0,"","","",{"$nulls":3},"","","",""]
["Library type",{"$nulls":5},0,{"$nulls":16},0,0,0,"","","",{"$nulls":3},"","","",""]
["Library selection",{"$nulls":5},0,{"$nulls":16},0,0,0,"","","",{"$nulls":3},"","","",""]
["Concentration librairie en qPCR(nM)",{"$f":"IF(B19=\"pur\",B22,IF(B19=\"dilution 1\",B25,IF(B19=\"dilution 2\",B28,IF(B19=\"dilution 3\",B31,\"\"))))","v":0},{"$nulls":4},0,{"$nulls":16},0,0,0,"","","",{"$nulls":3},"","","",""]
["Date qPCR",{"$nulls":5},0,{"$nulls":16},0,0,0,"","","",{"$nulls":3},"","","",""]
["Pool average size (pb)",{"$nulls":5},0,{"$nulls":16},0,0,0,"","","",{"$nulls":3},"","","",""]
["Vol. final pool (µl)",{"$f":"IFERROR(SUM(AC2:AC999),0)","v":{"v":0,"d":"0.00"}},{"$nulls":4},0,{"$nulls":16},0,0,0,"","","",{"$nulls":3},"","","",""]
["Specie (Scientific name)",{"$nulls":5},0,{"$nulls":16},0,0,0,"","","",{"$nulls":3},"","","",""]
["Taxonomy Id",{"$nulls":5},0,{"$nulls":16},0,0,0,"","","",{"$nulls":3},"","","",""]
["Date Réception",{"$nulls":5},0,{"$nulls":16},0,0,0,"","","",{"$nulls":3},"","","",""]
["Localisation actuelle",{"$nulls":5},0,{"$nulls":16},0,0,0,"","","",{"$nulls":3},"","","",""]
["Localisation de reference",{"$nulls":5},0,{"$nulls":16},0,0,0,"","","",{"$nulls":3},"","","",""]
["Dilution utilisée","pur",{"$nulls":4},0,{"$nulls":16},0,0,0,"","",""]
["Code-barre Pool pur",{"$nulls":5},0,{"$nulls":16},0,0,0,"","",""]
["Concentration estimée (nM)",{"$f":"IFERROR((SUM(AA2:AA41)/B13),0)","v":{"v":0,"d":"0.00"}},{"$nulls":4},0,{"$nulls":16},0,0,0,"","",""]
["Concentration dosée pure",{"$nulls":5},0,{"$nulls":16},0,0,0,"","","",{"$nulls":3},{"$f":"IF(E22<>\"\",E22,\"\")","v":""},{"$f":"IF(N22<>\"\",N22,\"\")","v":""},{"$f":"IF(Q22<>\"\",Q22,\"\")","v":""},{"$f":"IF(U22<>\"\",U22,\"\")","v":""}]
["Nom dilution 1",{"$nulls":5},0,{"$nulls":16},0,0,0,"","","",{"$nulls":3},{"$f":"IF(E23<>\"\",E23,\"\")","v":""},{"$f":"IF(N23<>\"\",N23,\"\")","v":""},{"$f":"IF(Q23<>\"\",Q23,\"\")","v":""},{"$f":"IF(U23<>\"\",U23,\"\")","v":""}]
["Code-barre dilution 1",{"$nulls":5},0,{"$nulls":16},0,0,0,"","",""]
["Concentration dilution 1",{"$nulls":5},0,{"$nulls":16},0,0,0,"","","",{"$nulls":3},{"$f":"IF(E25<>\"\",E25,\"\")","v":""},{"$f":"IF(N25<>\"\",N25,\"\")","v":""},{"$f":"IF(Q25<>\"\",Q25,\"\")","v":""},{"$f":"IF(U25<>\"\",U25,\"\")","v":""}]
["Nom dilution 2",{"$nulls":5},0,{"$nulls":16},0,0,0,"","","",{"$nulls":3},{"$f":"IF(E26<>\"\",E26,\"\")","v":""},{"$f":"IF(N26<>\"\",N26,\"\")","v":""},{"$f":"IF(Q26<>\"\",Q26,\"\")","v":""},{"$f":"IF(U26<>\"\",U26,\"\")","v":""}]
["Code-barre dilution 2",{"$nulls":5},0,{"$nulls":16},0,0,0,"","",""]
["Concentration dilution 2",{"$nulls":5},0,{"$nulls":16},0,0,0,"","","",{"$nulls":3},{"$f":"IF(E28<>\"\",E28,\"\")","v":""},{"$f":"IF(N28<>\"\",N28,\"\")","v":""},{"$f":"IF(Q28<>\"\",Q28,\"\")","v":""},{"$f":"IF(U28<>\"\",U28,\"\")","v":""}]
["Nom dilution 3",{"$nulls":5},0,{"$nulls":16},0,0,0,"","","",{"$nulls":3},{"$f":"IF(E29<>\"\",E29,\"\")","v":""},{"$f":"IF(N29<>\"\",N29,\"\")","v":""},{"$f":"IF(Q29<>\"\",Q29,\"\")","v":""},{"$f":"IF(U29<>\"\",U29,\"\")","v":""}]
["Code-barre dilution 3",{"$nulls":5},0,{"$nulls":16},0,0,0,"","",""]
["Concentration dilution 3",{"$nulls":5},0,{"$nulls":16},0,0,0,"","","",{"$nulls":3},{"$f":"IF(E31<>\"\",E31,\"\")","v":""},{"$f":"IF(N31<>\"\",N31,\"\")","v":""},{"$f":"IF(Q31<>\"\",Q31,\"\")","v":""},{"$f":"IF(U31<>\"\",U31,\"\")","v":""}]
[{"$nulls":6},0,{"$nulls":16},0,0,0,"","","",{"$nulls":3},"","","",""]
[{"$nulls":6},0,{"$nulls":16},0,0,0,"","","",{"$nulls":3},"","","",""]
[{"$nulls":6},0,{"$nulls":16},0,0,0,"","","",{"$nulls":3},"","","",""]
[{"$nulls":6},0,{"$nulls":16},0,0,0,"","","",{"$nulls":3},"","","",""]
[{"$nulls":6},0,{"$nulls":16},0,0,0,"","","",{"$nulls":3},"","","",""]
[{"$nulls":6},0,{"$nulls":16},0,0,0,"","","",{"$nulls":3},"","","",""]
[{"$nulls":6},0,{"$nulls":16},0,0,0,"","","",{"$nulls":3},"","","",""]
[{"$nulls":6},0,{"$nulls":16},0,0,0,"","","",{"$nulls":3},"","","",""]
[{"$nulls":6},0,{"$nulls":16},0,0,0,"","","",{"$nulls":3},"","","",""]
[{"$nulls":6},0,{"$nulls":16},0,0,0,"","","",{"$nulls":3},"","","",""]
[{"$nulls":6},0,{"$nulls":16},0,0,0,"","","",{"$nulls":3},"","","",""]
[{"$nulls":6},0,{"$nulls":16},0,0,0,"","","",{"$nulls":3},"","","",""]
[{"$nulls":6},0,{"$nulls":16},0,0,0,"","","",{"$nulls":3},"","","",""]
[{"$nulls":6},0,{"$nulls":16},0,0,0,"","","",{"$nulls":3},"","","",""]
[{"$nulls":6},0,{"$nulls":16},0,0,0,"","","",{"$nulls":3},"",{"$f":"IF(N46<>\"\",N46,\"\")","v":""},{"$f":"IF(Q46<>\"\",Q46,\"\")","v":""},{"$f":"IF(U46<>\"\",U46,\"\")","v":""}]
[{"$nulls":6},0,{"$nulls":16},0,0,0,"","",""]
[{"$nulls":6},0,{"$nulls":16},0,0,0,"","",""]
[{"$nulls":6},0,{"$nulls":16},0,0,0,"","",""]
[{"$nulls":6},0,{"$nulls":16},0,0,0,"","",""]
[{"$nulls":6},0,{"$nulls":16},0,0,0,"","",""]
[{"$nulls":6},0,{"$nulls":16},0,0,0,"","",""]
[{"$nulls":6},0,{"$nulls":16},0,0,0,"","",""]
[{"$nulls":6},0,{"$nulls":16},0,0,0,"","",""]
[{"$nulls":6},0,{"$nulls":16},0,0,0,"","",""]
[{"$nulls":6},0,{"$nulls":16},0,0,0,"","",""]
[{"$nulls":6},0,{"$nulls":16},0,0,0,"","",""]
[{"$nulls":6},0,{"$nulls":16},0,0,0,"","",""]
[{"$nulls":6},0,{"$nulls":16},0,0,0,"","",""]
[{"$nulls":6},0,{"$nulls":16},0,0,0,"","",""]
[{"$nulls":6},0,{"$nulls":16},0,0,0,"","",""]
[{"$nulls":6},0,{"$nulls":16},0,0,0,"","",""]
[{"$nulls":6},0,{"$nulls":16},0,0,0,"","",""]
[{"$nulls":6},0,{"$nulls":16},0,0,0,"","",""]
[{"$nulls":6},0,{"$nulls":16},0,0,0,"","",""]
[{"$nulls":6},0,{"$nulls":16},0,0,0,{"$f":"IF(C66<>\"\",20,\"\")","v":""},{"$f":"IF(E66<>\"\",E66,\"\")","v":""},""]
[{"$nulls":6},{"$f":"IF(C67<>\"\",$B$12,0)","v":0},{"$nulls":16},{"$f":"IFERROR(IF(T67<>\"\",T67,IF(P67<>\"\",P67,M67)),\"\")","v":0},{"$f":"IFERROR(IF(U67<>\"\",U67,IF(Q67<>\"\",Q67,N67)),\"\")","v":0},{"$f":"IFERROR(IF(V67<>\"\",V67,IF(R67<>\"\",R67,O67)),\"\")","v":0},"","",{"$f":"IF(C67<>\"\",IFERROR(IF(V67<>\"\",AA67/V67,IF(R67<>\"\",AA67/R67,IF(O67<>\"\",AA67/O67,0))),\"Erreur\"),\"\")","v":""}]
[{"$nulls":6},0,{"$nulls":16},0,0,0,"","",""]
[{"$nulls":6},0,{"$nulls":16},0,0,0,"","",""]
[{"$nulls":6},0,{"$nulls":16},0,0,0,"","",""]
[{"$nulls":6},0,{"$nulls":16},0,0,0,"","",""]
[{"$nulls":6},0,{"$nulls":16},0,0,0,"","",""]
[{"$nulls":6},0,{"$nulls":16},0,0,0,"","",""]
[{"$nulls":6},0,{"$nulls":16},0,0,0,"","",""]
[{"$nulls":6},0,{"$nulls":16},0,0,0,"","",""]
[{"$nulls":6},0,{"$nulls":16},0,0,0,"","",""]
[{"$nulls":6},0,{"$nulls":16},0,0,0,"","",""]
[{"$nulls":6},0,{"$nulls":16},0,0,0,"","",""]
[{"$nulls":6},0,{"$nulls":16},0,0,0,"","",""]
[{"$nulls":6},0,{"$nulls":16},0,0,0,"","",""]
[{"$nulls":6},0,{"$nulls":16},0,0,0,"","",""]
[{"$nulls":6},0,{"$nulls":16},0,0,0,"","",""]
[{"$nulls":6},0,{"$nulls":16},0,0,0,"","",""]
[{"$nulls":6},0,{"$nulls":16},0,0,0,"","",""]
[{"$nulls":6},0,{"$nulls":16},0,0,0,"","",""]
[{"$nulls":6},0,{"$nulls":16},0,0,0,"","",""]
[{"$nulls":6},0,{"$nulls":16},0,0,0,"","",""]
[{"$nulls":6},0,{"$nulls":16},0,0,0,"","",""]
[{"$nulls":6},0,{"$nulls":16},0,0,0,"","",""]
[{"$nulls":6},0,{"$nulls":16},0,0,0,"","",""]
[{"$nulls":6},0,{"$nulls":16},0,0,0,"","",""]
[{"$nulls":6},0,{"$nulls":16},0,0,0,"","",""]
[{"$nulls":6},0,{"$nulls":16},0,0,0,"","",""]
[{"$nulls":6},0,{"$nulls":16},0,0,0,"","",""]
[{"$nulls":6},0,{"$nulls":16},0,0,0,"","",""]
[{"$nulls":6},0,{"$nulls":16},0,0,0,"","",""]
[{"$nulls":6},0,{"$nulls":16},0,0,0,"","",""]
[{"$nulls":6},0,{"$nulls":16},0,0,0,"","",""]
[{"$nulls":6},0,{"$nulls":16},0,0,0,"","",""]
[{"$nulls":6},0,{"$nulls":16},0,0,0,"","",""]
[{"$nulls":6},0,{"$nulls":16},0,0,0,"","",""]
[{"$nulls":6},0,{"$nulls":16},0,0,0,"","",""]
[{"$nulls":6},0,{"$nulls":16},0,0,0,"","",""]
[{"$nulls":6},0,{"$nulls":16},0,0,0,"","",""]
[{"$nulls":6},0,{"$nulls":16},0,0,0,"","",""]
[{"$nulls":6},0,{"$nulls":16},0,0,0,"","",""]
[{"$nulls":6},0,{"$nulls":16},0,0,0,"","",""]
[{"$nulls":6},0,{"$nulls":16},0,0,0,"","",""]
[{"$nulls":6},0,{"$nulls":16},0,0,0,"","",""]
[{"$nulls":6},0,{"$nulls":16},0,0,0,"","",""]
[{"$nulls":6},0,{"$nulls":16},0,0,0,"","",""]
[{"$nulls":6},0,{"$nulls":16},0,0,0,"","",""]
[{"$nulls":6},0,{"$nulls":16},0,0,0,"","",""]
[{"$nulls":6},0,{"$nulls":16},0,0,0,"","",""]
[{"$nulls":6},0,{"$nulls":16},0,0,0,"","",""]
[{"$nulls":6},0,{"$nulls":16},0,0,0,"","",""]
[{"$nulls":6},0,{"$nulls":16},0,0,0,"","",""]
[{"$nulls":6},0,{"$nulls":16},0,0,0,"","",""]
[{"$nulls":6},0,{"$nulls":16},0,0,0,"","",""]
[{"$nulls":6},0,{"$nulls":16},0,0,0,"","",""]
{"$rows_left_out":880}
{"sheet":"Ressource","index":4,"n_rows":38,"n_cols":6,"rows_kept":38,"merged":[[0,0,0,1],[0,2,0,3],[0,4,0,5]]}
["Type of DNA or RNA used in the experiment",null,"Whether the source material was selected for certain properties (for\nexample methyl filtrated)",null,"The sequencing technique intended for the library."]
["library source","library source explanation","library selection","library selection explanation","Library strategy","Library strategy explanation"]
["GENOMIC"," Genomic DNA (includes PCR products from genomic DNA).","5-methylcytidine antibody"," Selection of methylated DNA fragments using an antibody raised against 5-methylcytosine or 5-methylcytidine (m5C).","AMPLICON"," Sequencing of overlapping or distinct PCR or RT-PCR products. For example, metagenomic community profiling using SSU rRNA."]
["GENOMIC SINGLE CELL","No description","CAGE"," Cap-analysis gene expression.","ATAC-seq"," Assay for Transposase-Accessible Chromatin (ATAC) strategy is used to study genome-wide chromatin accessibility. alternative method to DNase-seq that uses an engineered Tn5 transposase to cleave DNA and to integrate primer DNA sequences into the cleaved genomic DNA."]
["METAGENOMIC"," Mixed material from metagenome.","cDNA"," PolyA selection or enrichment for messenger RNA (mRNA); synonymize with PolyA","Bisulfite-Seq"," MethylC-seq. Sequencing following treatment of DNA with bisulfite to convert cytosine residues to uracil depending on methylation status."]
["METATRANSCRIPTOMIC"," Transcription products from community targets","cDNA_oligo_dT","No description","ChIA-PET"," Direct sequencing of proximity-ligated chromatin immunoprecipitates."]
["SYNTHETIC"," Synthetic DNA.","cDNA_randomPriming","No description","ChIP-Seq"," ChIP-seq, Chromatin ImmunoPrecipitation, reveals binding sites of specific proteins, typically transcription factors (TFs) using antibodies to extract DNA fragments bound to the target protein."]
["TRANSCRIPTOMIC"," Transcription products or non genomic DNA (EST, cDNA, RT-PCR, screened libraries).","ChIP"," Chromatin immunoprecipitation","CLONE"," Genomic clone based (hierarchical) sequencing."]
["TRANSCRIPTOMIC SINGLE CELL","No description","ChIP-Seq"," Chromatin immunoPrecipitation, reveals binding sites of specific proteins, typically transcription factors (TFs) using antibodies to extract DNA fragments bound to the target protein.","CLONEEND"," Clone end (5’, 3’, or both) sequencing."]
["VIRAL RNA"," Viral RNA.","DNase"," DNase I endonuclease digestion and size selection reveals regions of chromatin where the DNA is highly sensitive to DNase I.","CTS"," Concatenated Tag Sequencing"]
["OTHER"," Other, unspecified, or unknown library source material.","HMPR"," Hypo-methylated partial restriction digest","DNase-Hypersensitivity"," Sequencing of hypersensitive sites, or segments of open chromatin that are more readily cleaved by DNaseI."]
[null,null,"Hybrid Selection"," Selection by hybridization in array or solution.","EST"," Single pass sequencing of cDNA templates"]
[null,null,"Inverse rRNA"," depletion of ribosomal RNA by oligo hybridization.","FAIRE-seq"," Formaldehyde Assisted Isolation of Regulatory Elements. Reveals regions of open chromatin."]
[null,null,"Inverse rRNA selection"," depletion of ribosomal RNA by inverse oligo hybridization.","FINISHING"," Sequencing intended to finish (close) gaps in existing coverage."]
[null,null,"MBD2 protein methyl-CpG binding domain"," Enrichment by methyl-CpG binding domain.","FL-cDNA"," Full-length sequencing of cDNA templates"]
[null,null,"MDA"," Multiple Displacement Amplification, a non-PCR based DNA amplification technique that amplifies a minute quantifies of DNA to levels suitable for genomic analysis.","Hi-C"," Chromosome Conformation Capture technique where a biotin-labeled nucleotide is incorporated at the ligation junction, enabling selective purification of chimeric DNA ligation junctions followed by deep sequencing."]
[null,null,"MF"," Methyl Filtrated","MBD-Seq"," Methyl CpG Binding Domain Sequencing."]
[null,null,"MNase"," Identifies well-positioned nucleosomes. uses Micrococcal Nuclease (MNase) is an endo-exonuclease that processively digests DNA until an obstruction, such as a nucleosome, is reached.","MeDIP-Seq"," Methylated DNA Immunoprecipitation Sequencing."]
[null,null,"MSLL"," Methylation Spanning Linking Library","miRNA-Seq"," Micro RNA sequencing strategy designed to capture post-transcriptional RNA elements and include non-coding functional elements. (see pubmed 21787409 for details)"]
[null,null,"Oligo-dT"," enrichment of messenger RNA (mRNA) by hybridization to Oligo-dT.","MNase-Seq"," Identifies well-positioned nucleosomes. uses Micrococcal Nuclease (MNase) is an endo-exonuclease that processively digests DNA until an obstruction, such as a nucleosome, is reached."]
[null,null,"padlock probes capture method"," Targeted sequence capture protocol covering an arbitrary set of nonrepetitive genomics targets. An example is capture bisulfite sequencing using padlock probes (BSPP).","MRE-Seq"," Methylation-Sensitive Restriction Enzyme Sequencing."]
[null,null,"PCR"," target enrichment via PCR","ncRNA-Seq"," Capture of other non-coding RNA types, including post-translation modification types such as snRNA (small nuclear RNA) or snoRNA (small nucleolar RNA), or expression regulation types such as siRNA (small interfering RNA) or piRNA/piwi/RNA (piwi-interacting RNA)."]
[null,null,"PolyA"," PolyA selection or enrichment for messenger RNA (mRNA); should replace cDNA enumeration.","POOLCLONE"," Shotgun of pooled clones (usually BACs and Fosmids)."]
[null,null,"RACE"," Rapid Amplification of cDNA Ends.","RAD-Seq","No description"]
[null,null,"RANDOM"," No Selection or Random selection","RIP-Seq"," Direct sequencing of RNA immunoprecipitates (includes CLIP-Seq, HITS-CLIP and PAR-CLIP)."]
[null,null,"RANDOM PCR"," Source material was selected by randomly generated primers.","RNA-Seq"," Random sequencing of whole transcriptome, also known as Whole Transcriptome Shotgun Sequencing, or WTSS). (see pubmed 18611170 for details)"]
[null,null,"Reduced Representation"," Reproducible genomic subsets, often generated by restriction fragment size selection, containing a manageable number of loci to facilitate re-sampling.","SELEX"," Systematic Evolution of Ligands by Exponential enrichment"]
[null,null,"repeat fractionation"," Selection for less repetitive (and more gene rich) sequence through Cot filtration (CF) or other fractionation techniques based on DNA kinetics.","ssRNA-seq"," Strand-specific RNA sequencing."]
[null,null,"Restriction Digest"," DNA fractionation using restriction enzymes.","Synthetic-Long-Read"," binning and barcoding of large DNA fragments to facilitate assembly of the fragment"]
[null,null,"RT-PCR"," target enrichment via","Targeted-Capture"," Enrichment of a targeted subset of loci."]
[null,null,"size fractionation"," Physical selection of size appropriate targets.","Tethered Chromatin Conformation Capture"]
[null,null,"other"," Other library enrichment, screening, or selection process.","Tn-Seq"," Quantitatively determine fitness of bacterial genes based on how many times a purposely seeded transposon gets inserted into each gene of a colony after some time."]
[null,null,"unspecified"," Library enrichment, screening, or selection is not specified.","VALIDATION","  CGHub special request:  Independent experiment to re-evaluate putative variants."]
[{"$nulls":4},"WCS"," Random sequencing of a whole chromosome or other replicon isolated from a genome."]
[{"$nulls":4},"WGA"," Whole Genome Amplification followed by random sequencing. (see pubmed 1631067,8962113 for details)"]
[{"$nulls":4},"WGS"," Whole Genome Sequencing - random sequencing of the whole genome (see pubmed 10731132 for details)"]
[{"$nulls":4},"WXS"," Random sequencing of exonic regions selected from the genome. (see pubmed 20111037 for details)"]
[{"$nulls":4},"OTHER"," Library strategy not listed."]

{"sheet":"Version","index":5,"n_rows":14,"n_cols":3,"rows_kept":14}
["date","quoi","qui"]
["2023-07-27T09:03:00","ajout infos pour metadata ENA (lib, espèce, taxo)","Gérald"]
["2023-08-29T16:34:00","ajout possibilité de créer des worklists\najout liens vers ENA\ncalcul automatique de la taille moyenne d'insert du pool","Gérald"]
["2023-09-18T09:09:00","translate to english\nupdate macro to manage english version","Rachel/Eden\nGérald"]
["2023-10-02T10:38:00","mise à jour macro de calcul de volume de la lib pour la ligne 2\najout de contraintes pour certaines colonnes attendant des volumes ","Gérald"]
["2023-10-24T11:52:00","allow up to 1536 libs\ncorrect lib name validation to not allow -- and and space or dash at the end of the name","Gérald"]
["2024-03-13T10:37:00","block if species is not set or not found\ndo not make kit name mandatory for sample names validation\nblock if sample name does not respect constraint","Gérald"]
["2024-04-10T12:06:00","display a message to check administrative task after clicking on button 4","Gérald"]
["2024-06-25T16:10:00","Warn user if different run names are set for a pool (or different lib sizes  for an amplicon run)","Gérald"]
["2024-06-25T16:10:00","Remove sequence OK which is not useful anymore","Gérald"]
["2024-06-27T12:52:00","replace \"Library diversity\" with \"%PhiX to include\"\nReplace \"Taille Insert (pb)\" with \"Pool size (pb)\" in Lane sheet","Gérald"]
["2024-07-19T08:35:00","Change %PhiX to include cell format to numeric","Gérald"]
["2024-11-08T16:08:00","Add AVITI Flowcells ","Léo"]
["2024-12-06T08:47:00","add volumes for pool and lib","Léo/Gérald"]

{"sheet":"Pool Robot","index":6,"n_rows":1,"n_cols":5,"rows_kept":1,"hidden":true}
["SourceLabwareLabel","Source Position","Volumes","Destination Labware Label","Destination Position"]